{"text_format":"1","workbook":"xlsx","n_sheets":2,"sheets":["Sheet1","Sheet2"],"not_rendered":{"charts":0,"images":0,"macros":1,"external_links":0,"defined_names":4,"comments":1,"pivot_tables":0},"unopened":[],"bounds":{"document_bytes":16777216,"sheet_cells":100000,"rows_first":2000,"rows_last":500,"rows_between":2000,"halvings":0,"cell_chars":16384,"cell_head_chars":4096},"cells_cut":0,"cells_raw":0,"read":"whole","date_system":"1900"}

{"sheet":"Sheet1","index":0,"n_rows":504,"n_cols":18,"rows_kept":504,"cut":false,"hidden":false,"merged":[[2,1,2,9],[0,2,0,10],[1,1,1,4],[1,5,1,6]]}
[null,null,"SITE VISIT Qm CREATOR v1.3.2"]
["SiteVisit Email:","YOUR_ID@usgs.gov",null,null,null,"Collection Agency:",null,"USGS"]
["Output Path:","C:\\"]
["Meas No.","Station No.","Date\n(YYYYMMDD)","Time\n(HHMM)","Party\n(AAA/AAA)","Width\n(ft)","Area\n(ft3)","Velocity\n(ft/s)","Gage Ht\n(ft)","Discharge\n(ft3/s)","Qm Rated","Disch Method","Control Condition","Water Temp\n(°C)","Air Temp\n(°C)","Entry Status",{"$f":"COUNTIF(P5:P504,\"WARNING\")","v":0}]
[1,"01010000",20110101,954,"YES",253,200,0.5,6.3,100,"P","QSCMM","Light debris",12,2,{"$f":"IF(OR(A5<>\"\",B5<>\"\",C5<>\"\",E5<>\"\",F5<>\"\",G5<>\"\",H5<>\"\",I5<>\"\",J5<>\"\",K5<>\"\",L5<>\"\",M5<>\"\",N5<>\"\",O5<>\"\"),IF(AND(A5<>\"\",B5<>\"\",C5<>\"\",E5<>\"\",J5<>\"\",L5<>\"\"),IF(AND(G5<>\"\",H5<>\"\"),IF(AND(J5<(G5*H5)*1.02,J5>(G5*H5)*0.98),\"COMPLETE\",IF(OR(UPPER(L5)=\"QSCMM\",UPPER(L5)=\"QADCP\"),\"WARNING\",\"COMPLETE\")),\"COMPLETE\"),\"INCOMPLETE\"),\"\")","v":"COMPLETE"},{"$f":"IF(K5<>\"\",VLOOKUP(UPPER(K5),Sheet2!$A$3:$B$7,2,FALSE),\"\")","v":"POOR"},{"$f":"IF(M5<>\"\",VLOOKUP(UPPER(M5),Sheet2!$A$9:$B$24,2,FALSE),\"\")","v":"LGDB"}]
[null,null,null,null,null,null,null,null,null,null,null,null,null,null,null,{"$f":"IF(OR(A6<>\"\",B6<>\"\",C6<>\"\",E6<>\"\",F6<>\"\",G6<>\"\",H6<>\"\",I6<>\"\",J6<>\"\",K6<>\"\",L6<>\"\",M6<>\"\",N6<>\"\",O6<>\"\"),IF(AND(A6<>\"\",B6<>\"\",C6<>\"\",E6<>\"\",J6<>\"\",L6<>\"\"),IF(AND(G6<>\"\",H6<>\"\"),IF(AND(J6<(G6*H6)*1.02,J6>(G6*H6)*0.98),\"COMPLETE\",IF(OR(UPPER(L6)=\"QSCMM\",UPPER(L6)=\"QADCP\"),\"WARNING\",\"COMPLETE\")),\"COMPLETE\"),\"INCOMPLETE\"),\"\")","v":""},{"$f":"IF(K6<>\"\",VLOOKUP(UPPER(K6),Sheet2!$A$3:$B$7,2,FALSE),\"\")","v":""},{"$f":"IF(M6<>\"\",VLOOKUP(UPPER(M6),Sheet2!$A$9:$B$24,2,FALSE),\"\")","v":""}]
[null,null,null,null,null,null,null,null,null,null,null,null,null,null,null,"",{"$f":"IF(K7<>\"\",VLOOKUP(UPPER(K7),Sheet2!$A$3:$B$7,2,FALSE),\"\")","v":""},{"$f":"IF(M7<>\"\",VLOOKUP(UPPER(M7),Sheet2!$A$9:$B$24,2,FALSE),\"\")","v":""}]
[null,null,null,null,null,null,null,null,null,null,null,null,null,null,null,"",{"$f":"IF(K8<>\"\",VLOOKUP(UPPER(K8),Sheet2!$A$3:$B$7,2,FALSE),\"\")","v":""},{"$f":"IF(M8<>\"\",VLOOKUP(UPPER(M8),Sheet2!$A$9:$B$24,2,FALSE),\"\")","v":""}]
[null,null,null,null,null,null,null,null,null,null,null,null,null,null,null,"",{"$f":"IF(K9<>\"\",VLOOKUP(UPPER(K9),Sheet2!$A$3:$B$7,2,FALSE),\"\")","v":""},{"$f":"IF(M9<>\"\",VLOOKUP(UPPER(M9),Sheet2!$A$9:$B$24,2,FALSE),\"\")","v":""}]
[null,null,null,null,null,null,null,null,null,null,null,null,null,null,null,"",{"$f":"IF(K10<>\"\",VLOOKUP(UPPER(K10),Sheet2!$A$3:$B$7,2,FALSE),\"\")","v":""},{"$f":"IF(M10<>\"\",VLOOKUP(UPPER(M10),Sheet2!$A$9:$B$24,2,FALSE),\"\")","v":""}]
[null,null,null,null,null,null,null,null,null,null,null,null,null,null,null,"",{"$f":"IF(K11<>\"\",VLOOKUP(UPPER(K11),Sheet2!$A$3:$B$7,2,FALSE),\"\")","v":""},{"$f":"IF(M11<>\"\",VLOOKUP(UPPER(M11),Sheet2!$A$9:$B$24,2,FALSE),\"\")","v":""}]
[null,null,null,null,null,null,null,null,null,null,null,null,null,null,null,"",{"$f":"IF(K12<>\"\",VLOOKUP(UPPER(K12),Sheet2!$A$3:$B$7,2,FALSE),\"\")","v":""},{"$f":"IF(M12<>\"\",VLOOKUP(UPPER(M12),Sheet2!$A$9:$B$24,2,FALSE),\"\")","v":""}]
[null,null,null,null,null,null,null,null,null,null,null,null,null,null,null,"",{"$f":"IF(K13<>\"\",VLOOKUP(UPPER(K13),Sheet2!$A$3:$B$7,2,FALSE),\"\")","v":""},{"$f":"IF(M13<>\"\",VLOOKUP(UPPER(M13),Sheet2!$A$9:$B$24,2,FALSE),\"\")","v":""}]
[null,null,null,null,null,null,null,null,null,null,null,null,null,null,null,"",{"$f":"IF(K14<>\"\",VLOOKUP(UPPER(K14),Sheet2!$A$3:$B$7,2,FALSE),\"\")","v":""},{"$f":"IF(M14<>\"\",VLOOKUP(UPPER(M14),Sheet2!$A$9:$B$24,2,FALSE),\"\")","v":""}]
[null,null,null,null,null,null,null,null,null,null,null,null,null,null,null,"",{"$f":"IF(K15<>\"\",VLOOKUP(UPPER(K15),Sheet2!$A$3:$B$7,2,FALSE),\"\")","v":""},{"$f":"IF(M15<>\"\",VLOOKUP(UPPER(M15),Sheet2!$A$9:$B$24,2,FALSE),\"\")","v":""}]
[null,null,null,null,null,null,null,null,null,null,null,null,null,null,null,"",{"$f":"IF(K16<>\"\",VLOOKUP(UPPER(K16),Sheet2!$A$3:$B$7,2,FALSE),\"\")","v":""},{"$f":"IF(M16<>\"\",VLOOKUP(UPPER(M16),Sheet2!$A$9:$B$24,2,FALSE),\"\")","v":""}]
[null,null,null,null,null,null,null,null,null,null,null,null,null,null,null,"",{"$f":"IF(K17<>\"\",VLOOKUP(UPPER(K17),Sheet2!$A$3:$B$7,2,FALSE),\"\")","v":""},{"$f":"IF(M17<>\"\",VLOOKUP(UPPER(M17),Sheet2!$A$9:$B$24,2,FALSE),\"\")","v":""}]
[null,null,null,null,null,null,null,null,null,null,null,null,null,null,null,"",{"$f":"IF(K18<>\"\",VLOOKUP(UPPER(K18),Sheet2!$A$3:$B$7,2,FALSE),\"\")","v":""},{"$f":"IF(M18<>\"\",VLOOKUP(UPPER(M18),Sheet2!$A$9:$B$24,2,FALSE),\"\")","v":""}]
[null,null,null,null,null,null,null,null,null,null,null,null,null,null,null,"",{"$f":"IF(K19<>\"\",VLOOKUP(UPPER(K19),Sheet2!$A$3:$B$7,2,FALSE),\"\")","v":""},{"$f":"IF(M19<>\"\",VLOOKUP(UPPER(M19),Sheet2!$A$9:$B$24,2,FALSE),\"\")","v":""}]
[null,null,null,null,null,null,null,null,null,null,null,null,null,null,null,"",{"$f":"IF(K20<>\"\",VLOOKUP(UPPER(K20),Sheet2!$A$3:$B$7,2,FALSE),\"\")","v":""},{"$f":"IF(M20<>\"\",VLOOKUP(UPPER(M20),Sheet2!$A$9:$B$24,2,FALSE),\"\")","v":""}]
[null,null,null,null,null,null,null,null,null,null,null,null,null,null,null,"",{"$f":"IF(K21<>\"\",VLOOKUP(UPPER(K21),Sheet2!$A$3:$B$7,2,FALSE),\"\")","v":""},{"$f":"IF(M21<>\"\",VLOOKUP(UPPER(M21),Sheet2!$A$9:$B$24,2,FALSE),\"\")","v":""}]
[null,null,null,null,null,null,null,null,null,null,null,null,null,null,null,"",{"$f":"IF(K22<>\"\",VLOOKUP(UPPER(K22),Sheet2!$A$3:$B$7,2,FALSE),\"\")","v":""},{"$f":"IF(M22<>\"\",VLOOKUP(UPPER(M22),Sheet2!$A$9:$B$24,2,FALSE),\"\")","v":""}]
[null,null,null,null,null,null,null,null,null,null,null,null,null,null,null,"",{"$f":"IF(K23<>\"\",VLOOKUP(UPPER(K23),Sheet2!$A$3:$B$7,2,FALSE),\"\")","v":""},{"$f":"IF(M23<>\"\",VLOOKUP(UPPER(M23),Sheet2!$A$9:$B$24,2,FALSE),\"\")","v":""}]
[null,null,null,null,null,null,null,null,null,null,null,null,null,null,null,"",{"$f":"IF(K24<>\"\",VLOOKUP(UPPER(K24),Sheet2!$A$3:$B$7,2,FALSE),\"\")","v":""},{"$f":"IF(M24<>\"\",VLOOKUP(UPPER(M24),Sheet2!$A$9:$B$24,2,FALSE),\"\")","v":""}]
[null,null,null,null,null,null,null,null,null,null,null,null,null,null,null,"",{"$f":"IF(K25<>\"\",VLOOKUP(UPPER(K25),Sheet2!$A$3:$B$7,2,FALSE),\"\")","v":""},{"$f":"IF(M25<>\"\",VLOOKUP(UPPER(M25),Sheet2!$A$9:$B$24,2,FALSE),\"\")","v":""}]
[null,null,null,null,null,null,null,null,null,null,null,null,null,null,null,"",{"$f":"IF(K26<>\"\",VLOOKUP(UPPER(K26),Sheet2!$A$3:$B$7,2,FALSE),\"\")","v":""},{"$f":"IF(M26<>\"\",VLOOKUP(UPPER(M26),Sheet2!$A$9:$B$24,2,FALSE),\"\")","v":""}]
[null,null,null,null,null,null,null,null,null,null,null,null,null,null,null,"",{"$f":"IF(K27<>\"\",VLOOKUP(UPPER(K27),Sheet2!$A$3:$B$7,2,FALSE),\"\")","v":""},{"$f":"IF(M27<>\"\",VLOOKUP(UPPER(M27),Sheet2!$A$9:$B$24,2,FALSE),\"\")","v":""}]
[null,null,null,null,null,null,null,null,null,null,null,null,null,null,null,"",{"$f":"IF(K28<>\"\",VLOOKUP(UPPER(K28),Sheet2!$A$3:$B$7,2,FALSE),\"\")","v":""},{"$f":"IF(M28<>\"\",VLOOKUP(UPPER(M28),Sheet2!$A$9:$B$24,2,FALSE),\"\")","v":""}]
[null,null,null,null,null,null,null,null,null,null,null,null,null,null,null,"",{"$f":"IF(K29<>\"\",VLOOKUP(UPPER(K29),Sheet2!$A$3:$B$7,2,FALSE),\"\")","v":""},{"$f":"IF(M29<>\"\",VLOOKUP(UPPER(M29),Sheet2!$A$9:$B$24,2,FALSE),\"\")","v":""}]
[null,null,null,null,null,null,null,null,null,null,null,null,null,null,null,"",{"$f":"IF(K30<>\"\",VLOOKUP(UPPER(K30),Sheet2!$A$3:$B$7,2,FALSE),\"\")","v":""},{"$f":"IF(M30<>\"\",VLOOKUP(UPPER(M30),Sheet2!$A$9:$B$24,2,FALSE),\"\")","v":""}]
[null,null,null,null,null,null,null,null,null,null,null,null,null,null,null,"",{"$f":"IF(K31<>\"\",VLOOKUP(UPPER(K31),Sheet2!$A$3:$B$7,2,FALSE),\"\")","v":""},{"$f":"IF(M31<>\"\",VLOOKUP(UPPER(M31),Sheet2!$A$9:$B$24,2,FALSE),\"\")","v":""}]
[null,null,null,null,null,null,null,null,null,null,null,null,null,null,null,"",{"$f":"IF(K32<>\"\",VLOOKUP(UPPER(K32),Sheet2!$A$3:$B$7,2,FALSE),\"\")","v":""},{"$f":"IF(M32<>\"\",VLOOKUP(UPPER(M32),Sheet2!$A$9:$B$24,2,FALSE),\"\")","v":""}]
[null,null,null,null,null,null,null,null,null,null,null,null,null,null,null,"",{"$f":"IF(K33<>\"\",VLOOKUP(UPPER(K33),Sheet2!$A$3:$B$7,2,FALSE),\"\")","v":""},{"$f":"IF(M33<>\"\",VLOOKUP(UPPER(M33),Sheet2!$A$9:$B$24,2,FALSE),\"\")","v":""}]
[null,null,null,null,null,null,null,null,null,null,null,null,null,null,null,"",{"$f":"IF(K34<>\"\",VLOOKUP(UPPER(K34),Sheet2!$A$3:$B$7,2,FALSE),\"\")","v":""},{"$f":"IF(M34<>\"\",VLOOKUP(UPPER(M34),Sheet2!$A$9:$B$24,2,FALSE),\"\")","v":""}]
[null,null,null,null,null,null,null,null,null,null,null,null,null,null,null,"",{"$f":"IF(K35<>\"\",VLOOKUP(UPPER(K35),Sheet2!$A$3:$B$7,2,FALSE),\"\")","v":""},{"$f":"IF(M35<>\"\",VLOOKUP(UPPER(M35),Sheet2!$A$9:$B$24,2,FALSE),\"\")","v":""}]
[null,null,null,null,null,null,null,null,null,null,null,null,null,null,null,"",{"$f":"IF(K36<>\"\",VLOOKUP(UPPER(K36),Sheet2!$A$3:$B$7,2,FALSE),\"\")","v":""},{"$f":"IF(M36<>\"\",VLOOKUP(UPPER(M36),Sheet2!$A$9:$B$24,2,FALSE),\"\")","v":""}]
[null,null,null,null,null,null,null,null,null,null,null,null,null,null,null,"",{"$f":"IF(K37<>\"\",VLOOKUP(UPPER(K37),Sheet2!$A$3:$B$7,2,FALSE),\"\")","v":""},{"$f":"IF(M37<>\"\",VLOOKUP(UPPER(M37),Sheet2!$A$9:$B$24,2,FALSE),\"\")","v":""}]
[null,null,null,null,null,null,null,null,null,null,null,null,null,null,null,"",{"$f":"IF(K38<>\"\",VLOOKUP(UPPER(K38),Sheet2!$A$3:$B$7,2,FALSE),\"\")","v":""},{"$f":"IF(M38<>\"\",VLOOKUP(UPPER(M38),Sheet2!$A$9:$B$24,2,FALSE),\"\")","v":""}]
[null,null,null,null,null,null,null,null,null,null,null,null,null,null,null,"",{"$f":"IF(K39<>\"\",VLOOKUP(UPPER(K39),Sheet2!$A$3:$B$7,2,FALSE),\"\")","v":""},{"$f":"IF(M39<>\"\",VLOOKUP(UPPER(M39),Sheet2!$A$9:$B$24,2,FALSE),\"\")","v":""}]
[null,null,null,null,null,null,null,null,null,null,null,null,null,null,null,"",{"$f":"IF(K40<>\"\",VLOOKUP(UPPER(K40),Sheet2!$A$3:$B$7,2,FALSE),\"\")","v":""},{"$f":"IF(M40<>\"\",VLOOKUP(UPPER(M40),Sheet2!$A$9:$B$24,2,FALSE),\"\")","v":""}]
[null,null,null,null,null,null,null,null,null,null,null,null,null,null,null,"",{"$f":"IF(K41<>\"\",VLOOKUP(UPPER(K41),Sheet2!$A$3:$B$7,2,FALSE),\"\")","v":""},{"$f":"IF(M41<>\"\",VLOOKUP(UPPER(M41),Sheet2!$A$9:$B$24,2,FALSE),\"\")","v":""}]
[null,null,null,null,null,null,null,null,null,null,null,null,null,null,null,"",{"$f":"IF(K42<>\"\",VLOOKUP(UPPER(K42),Sheet2!$A$3:$B$7,2,FALSE),\"\")","v":""},{"$f":"IF(M42<>\"\",VLOOKUP(UPPER(M42),Sheet2!$A$9:$B$24,2,FALSE),\"\")","v":""}]
[null,null,null,null,null,null,null,null,null,null,null,null,null,null,null,"",{"$f":"IF(K43<>\"\",VLOOKUP(UPPER(K43),Sheet2!$A$3:$B$7,2,FALSE),\"\")","v":""},{"$f":"IF(M43<>\"\",VLOOKUP(UPPER(M43),Sheet2!$A$9:$B$24,2,FALSE),\"\")","v":""}]
[null,null,null,null,null,null,null,null,null,null,null,null,null,null,null,"",{"$f":"IF(K44<>\"\",VLOOKUP(UPPER(K44),Sheet2!$A$3:$B$7,2,FALSE),\"\")","v":""},{"$f":"IF(M44<>\"\",VLOOKUP(UPPER(M44),Sheet2!$A$9:$B$24,2,FALSE),\"\")","v":""}]
[null,null,null,null,null,null,null,null,null,null,null,null,null,null,null,"",{"$f":"IF(K45<>\"\",VLOOKUP(UPPER(K45),Sheet2!$A$3:$B$7,2,FALSE),\"\")","v":""},{"$f":"IF(M45<>\"\",VLOOKUP(UPPER(M45),Sheet2!$A$9:$B$24,2,FALSE),\"\")","v":""}]
[null,null,null,null,null,null,null,null,null,null,null,null,null,null,null,"",{"$f":"IF(K46<>\"\",VLOOKUP(UPPER(K46),Sheet2!$A$3:$B$7,2,FALSE),\"\")","v":""},{"$f":"IF(M46<>\"\",VLOOKUP(UPPER(M46),Sheet2!$A$9:$B$24,2,FALSE),\"\")","v":""}]
[null,null,null,null,null,null,null,null,null,null,null,null,null,null,null,"",{"$f":"IF(K47<>\"\",VLOOKUP(UPPER(K47),Sheet2!$A$3:$B$7,2,FALSE),\"\")","v":""},{"$f":"IF(M47<>\"\",VLOOKUP(UPPER(M47),Sheet2!$A$9:$B$24,2,FALSE),\"\")","v":""}]
[null,null,null,null,null,null,null,null,null,null,null,null,null,null,null,"",{"$f":"IF(K48<>\"\",VLOOKUP(UPPER(K48),Sheet2!$A$3:$B$7,2,FALSE),\"\")","v":""},{"$f":"IF(M48<>\"\",VLOOKUP(UPPER(M48),Sheet2!$A$9:$B$24,2,FALSE),\"\")","v":""}]
[null,null,null,null,null,null,null,null,null,null,null,null,null,null,null,"",{"$f":"IF(K49<>\"\",VLOOKUP(UPPER(K49),Sheet2!$A$3:$B$7,2,FALSE),\"\")","v":""},{"$f":"IF(M49<>\"\",VLOOKUP(UPPER(M49),Sheet2!$A$9:$B$24,2,FALSE),\"\")","v":""}]
[null,null,null,null,null,null,null,null,null,null,null,null,null,null,null,"",{"$f":"IF(K50<>\"\",VLOOKUP(UPPER(K50),Sheet2!$A$3:$B$7,2,FALSE),\"\")","v":""},{"$f":"IF(M50<>\"\",VLOOKUP(UPPER(M50),Sheet2!$A$9:$B$24,2,FALSE),\"\")","v":""}]
[null,null,null,null,null,null,null,null,null,null,null,null,null,null,null,"",{"$f":"IF(K51<>\"\",VLOOKUP(UPPER(K51),Sheet2!$A$3:$B$7,2,FALSE),\"\")","v":""},{"$f":"IF(M51<>\"\",VLOOKUP(UPPER(M51),Sheet2!$A$9:$B$24,2,FALSE),\"\")","v":""}]
[null,null,null,null,null,null,null,null,null,null,null,null,null,null,null,"",{"$f":"IF(K52<>\"\",VLOOKUP(UPPER(K52),Sheet2!$A$3:$B$7,2,FALSE),\"\")","v":""},{"$f":"IF(M52<>\"\",VLOOKUP(UPPER(M52),Sheet2!$A$9:$B$24,2,FALSE),\"\")","v":""}]
[null,null,null,null,null,null,null,null,null,null,null,null,null,null,null,"",{"$f":"IF(K53<>\"\",VLOOKUP(UPPER(K53),Sheet2!$A$3:$B$7,2,FALSE),\"\")","v":""},{"$f":"IF(M53<>\"\",VLOOKUP(UPPER(M53),Sheet2!$A$9:$B$24,2,FALSE),\"\")","v":""}]
[null,null,null,null,null,null,null,null,null,null,null,null,null,null,null,"",{"$f":"IF(K54<>\"\",VLOOKUP(UPPER(K54),Sheet2!$A$3:$B$7,2,FALSE),\"\")","v":""},{"$f":"IF(M54<>\"\",VLOOKUP(UPPER(M54),Sheet2!$A$9:$B$24,2,FALSE),\"\")","v":""}]
[null,null,null,null,null,null,null,null,null,null,null,null,null,null,null,"",{"$f":"IF(K55<>\"\",VLOOKUP(UPPER(K55),Sheet2!$A$3:$B$7,2,FALSE),\"\")","v":""},{"$f":"IF(M55<>\"\",VLOOKUP(UPPER(M55),Sheet2!$A$9:$B$24,2,FALSE),\"\")","v":""}]
[null,null,null,null,null,null,null,null,null,null,null,null,null,null,null,"",{"$f":"IF(K56<>\"\",VLOOKUP(UPPER(K56),Sheet2!$A$3:$B$7,2,FALSE),\"\")","v":""},{"$f":"IF(M56<>\"\",VLOOKUP(UPPER(M56),Sheet2!$A$9:$B$24,2,FALSE),\"\")","v":""}]
[null,null,null,null,null,null,null,null,null,null,null,null,null,null,null,"",{"$f":"IF(K57<>\"\",VLOOKUP(UPPER(K57),Sheet2!$A$3:$B$7,2,FALSE),\"\")","v":""},{"$f":"IF(M57<>\"\",VLOOKUP(UPPER(M57),Sheet2!$A$9:$B$24,2,FALSE),\"\")","v":""}]
[null,null,null,null,null,null,null,null,null,null,null,null,null,null,null,"",{"$f":"IF(K58<>\"\",VLOOKUP(UPPER(K58),Sheet2!$A$3:$B$7,2,FALSE),\"\")","v":""},{"$f":"IF(M58<>\"\",VLOOKUP(UPPER(M58),Sheet2!$A$9:$B$24,2,FALSE),\"\")","v":""}]
[null,null,null,null,null,null,null,null,null,null,null,null,null,null,null,"",{"$f":"IF(K59<>\"\",VLOOKUP(UPPER(K59),Sheet2!$A$3:$B$7,2,FALSE),\"\")","v":""},{"$f":"IF(M59<>\"\",VLOOKUP(UPPER(M59),Sheet2!$A$9:$B$24,2,FALSE),\"\")","v":""}]
[null,null,null,null,null,null,null,null,null,null,null,null,null,null,null,"",{"$f":"IF(K60<>\"\",VLOOKUP(UPPER(K60),Sheet2!$A$3:$B$7,2,FALSE),\"\")","v":""},{"$f":"IF(M60<>\"\",VLOOKUP(UPPER(M60),Sheet2!$A$9:$B$24,2,FALSE),\"\")","v":""}]
[null,null,null,null,null,null,null,null,null,null,null,null,null,null,null,"",{"$f":"IF(K61<>\"\",VLOOKUP(UPPER(K61),Sheet2!$A$3:$B$7,2,FALSE),\"\")","v":""},{"$f":"IF(M61<>\"\",VLOOKUP(UPPER(M61),Sheet2!$A$9:$B$24,2,FALSE),\"\")","v":""}]
[null,null,null,null,null,null,null,null,null,null,null,null,null,null,null,"",{"$f":"IF(K62<>\"\",VLOOKUP(UPPER(K62),Sheet2!$A$3:$B$7,2,FALSE),\"\")","v":""},{"$f":"IF(M62<>\"\",VLOOKUP(UPPER(M62),Sheet2!$A$9:$B$24,2,FALSE),\"\")","v":""}]
[null,null,null,null,null,null,null,null,null,null,null,null,null,null,null,"",{"$f":"IF(K63<>\"\",VLOOKUP(UPPER(K63),Sheet2!$A$3:$B$7,2,FALSE),\"\")","v":""},{"$f":"IF(M63<>\"\",VLOOKUP(UPPER(M63),Sheet2!$A$9:$B$24,2,FALSE),\"\")","v":""}]
[null,null,null,null,null,null,null,null,null,null,null,null,null,null,null,"",{"$f":"IF(K64<>\"\",VLOOKUP(UPPER(K64),Sheet2!$A$3:$B$7,2,FALSE),\"\")","v":""},{"$f":"IF(M64<>\"\",VLOOKUP(UPPER(M64),Sheet2!$A$9:$B$24,2,FALSE),\"\")","v":""}]
[null,null,null,null,null,null,null,null,null,null,null,null,null,null,null,"",{"$f":"IF(K65<>\"\",VLOOKUP(UPPER(K65),Sheet2!$A$3:$B$7,2,FALSE),\"\")","v":""},{"$f":"IF(M65<>\"\",VLOOKUP(UPPER(M65),Sheet2!$A$9:$B$24,2,FALSE),\"\")","v":""}]
[null,null,null,null,null,null,null,null,null,null,null,null,null,null,null,"",{"$f":"IF(K66<>\"\",VLOOKUP(UPPER(K66),Sheet2!$A$3:$B$7,2,FALSE),\"\")","v":""},{"$f":"IF(M66<>\"\",VLOOKUP(UPPER(M66),Sheet2!$A$9:$B$24,2,FALSE),\"\")","v":""}]
[null,null,null,null,null,null,null,null,null,null,null,null,null,null,null,"",{"$f":"IF(K67<>\"\",VLOOKUP(UPPER(K67),Sheet2!$A$3:$B$7,2,FALSE),\"\")","v":""},{"$f":"IF(M67<>\"\",VLOOKUP(UPPER(M67),Sheet2!$A$9:$B$24,2,FALSE),\"\")","v":""}]
[null,null,null,null,null,null,null,null,null,null,null,null,null,null,null,"",{"$f":"IF(K68<>\"\",VLOOKUP(UPPER(K68),Sheet2!$A$3:$B$7,2,FALSE),\"\")","v":""},{"$f":"IF(M68<>\"\",VLOOKUP(UPPER(M68),Sheet2!$A$9:$B$24,2,FALSE),\"\")","v":""}]
[null,null,null,null,null,null,null,null,null,null,null,null,null,null,null,"",{"$f":"IF(K69<>\"\",VLOOKUP(UPPER(K69),Sheet2!$A$3:$B$7,2,FALSE),\"\")","v":""},{"$f":"IF(M69<>\"\",VLOOKUP(UPPER(M69),Sheet2!$A$9:$B$24,2,FALSE),\"\")","v":""}]
[null,null,null,null,null,null,null,null,null,null,null,null,null,null,null,{"$f":"IF(OR(A70<>\"\",B70<>\"\",C70<>\"\",E70<>\"\",F70<>\"\",G70<>\"\",H70<>\"\",I70<>\"\",J70<>\"\",K70<>\"\",L70<>\"\",M70<>\"\",N70<>\"\",O70<>\"\"),IF(AND(A70<>\"\",B70<>\"\",C70<>\"\",E70<>\"\",J70<>\"\",L70<>\"\"),IF(AND(G70<>\"\",H70<>\"\"),IF(AND(J70<(G70*H70)*1.02,J70>(G70*H70)*0.98),\"COMPLETE\",IF(OR(UPPER(L70)=\"QSCMM\",UPPER(L70)=\"QADCP\"),\"WARNING\",\"COMPLETE\")),\"COMPLETE\"),\"INCOMPLETE\"),\"\")","v":""},{"$f":"IF(K70<>\"\",VLOOKUP(UPPER(K70),Sheet2!$A$3:$B$7,2,FALSE),\"\")","v":""},{"$f":"IF(M70<>\"\",VLOOKUP(UPPER(M70),Sheet2!$A$9:$B$24,2,FALSE),\"\")","v":""}]
[null,null,null,null,null,null,null,null,null,null,null,null,null,null,null,"",{"$f":"IF(K71<>\"\",VLOOKUP(UPPER(K71),Sheet2!$A$3:$B$7,2,FALSE),\"\")","v":""},{"$f":"IF(M71<>\"\",VLOOKUP(UPPER(M71),Sheet2!$A$9:$B$24,2,FALSE),\"\")","v":""}]
[null,null,null,null,null,null,null,null,null,null,null,null,null,null,null,"",{"$f":"IF(K72<>\"\",VLOOKUP(UPPER(K72),Sheet2!$A$3:$B$7,2,FALSE),\"\")","v":""},{"$f":"IF(M72<>\"\",VLOOKUP(UPPER(M72),Sheet2!$A$9:$B$24,2,FALSE),\"\")","v":""}]
[null,null,null,null,null,null,null,null,null,null,null,null,null,null,null,"",{"$f":"IF(K73<>\"\",VLOOKUP(UPPER(K73),Sheet2!$A$3:$B$7,2,FALSE),\"\")","v":""},{"$f":"IF(M73<>\"\",VLOOKUP(UPPER(M73),Sheet2!$A$9:$B$24,2,FALSE),\"\")","v":""}]
[null,null,null,null,null,null,null,null,null,null,null,null,null,null,null,"",{"$f":"IF(K74<>\"\",VLOOKUP(UPPER(K74),Sheet2!$A$3:$B$7,2,FALSE),\"\")","v":""},{"$f":"IF(M74<>\"\",VLOOKUP(UPPER(M74),Sheet2!$A$9:$B$24,2,FALSE),\"\")","v":""}]
[null,null,null,null,null,null,null,null,null,null,null,null,null,null,null,"",{"$f":"IF(K75<>\"\",VLOOKUP(UPPER(K75),Sheet2!$A$3:$B$7,2,FALSE),\"\")","v":""},{"$f":"IF(M75<>\"\",VLOOKUP(UPPER(M75),Sheet2!$A$9:$B$24,2,FALSE),\"\")","v":""}]
[null,null,null,null,null,null,null,null,null,null,null,null,null,null,null,"",{"$f":"IF(K76<>\"\",VLOOKUP(UPPER(K76),Sheet2!$A$3:$B$7,2,FALSE),\"\")","v":""},{"$f":"IF(M76<>\"\",VLOOKUP(UPPER(M76),Sheet2!$A$9:$B$24,2,FALSE),\"\")","v":""}]
[null,null,null,null,null,null,null,null,null,null,null,null,null,null,null,"",{"$f":"IF(K77<>\"\",VLOOKUP(UPPER(K77),Sheet2!$A$3:$B$7,2,FALSE),\"\")","v":""},{"$f":"IF(M77<>\"\",VLOOKUP(UPPER(M77),Sheet2!$A$9:$B$24,2,FALSE),\"\")","v":""}]
[null,null,null,null,null,null,null,null,null,null,null,null,null,null,null,"",{"$f":"IF(K78<>\"\",VLOOKUP(UPPER(K78),Sheet2!$A$3:$B$7,2,FALSE),\"\")","v":""},{"$f":"IF(M78<>\"\",VLOOKUP(UPPER(M78),Sheet2!$A$9:$B$24,2,FALSE),\"\")","v":""}]
[null,null,null,null,null,null,null,null,null,null,null,null,null,null,null,"",{"$f":"IF(K79<>\"\",VLOOKUP(UPPER(K79),Sheet2!$A$3:$B$7,2,FALSE),\"\")","v":""},{"$f":"IF(M79<>\"\",VLOOKUP(UPPER(M79),Sheet2!$A$9:$B$24,2,FALSE),\"\")","v":""}]
[null,null,null,null,null,null,null,null,null,null,null,null,null,null,null,"",{"$f":"IF(K80<>\"\",VLOOKUP(UPPER(K80),Sheet2!$A$3:$B$7,2,FALSE),\"\")","v":""},{"$f":"IF(M80<>\"\",VLOOKUP(UPPER(M80),Sheet2!$A$9:$B$24,2,FALSE),\"\")","v":""}]
{"$rows_left_out":425}
{"sheet":"Sheet2","index":1,"n_rows":24,"n_cols":4,"rows_kept":24,"cut":false,"hidden":false,"merged":[[0,1,0,2]]}
[null,"Reference Lists"]
[]
["E","EXCL",null,"QADCP"]
["G","GOOD",null,"QFLUM"]
["F","FAIR",null,"QSCMM"]
["P","POOR",null,"QVOLM"]
["U","UNSP",null,"QWEIR"]
[null,null,null,"QUNSP"]
[]
["Unspecified","UNSP"]
["Anchor ice","AICE"]
["Ice cover","CICE"]
["Clear","CLER"]
["Fill control changed","FILL"]
["Heavy debris","HVDB"]
["Light debris","LGDB"]
["Heavy moss/algae","MAHV"]
["Light moss/algae","MALT"]
["Moderate moss/algae","MAMD"]
["Moderate debris","MDDB"]
["No flow","NFLW"]
["Scour control changed","SCUR"]
["Shore ice","SICE"]
["Submerged","SUBM"]