{"text_format":"1","workbook":"xlsx","n_sheets":2,"sheets":["Sheet1","Sheet2"],"not_rendered":{"charts":0,"images":0,"macros":1,"external_links":0,"defined_names":0,"comments":0,"pivot_tables":0},"unopened":[],"bounds":{"document_bytes":16777216,"sheet_cells":100000,"rows_first":2000,"rows_last":500,"rows_between":2000,"halvings":0,"cell_chars":16384,"cell_head_chars":4096},"cells_cut":0,"cells_raw":0,"read":"whole","date_system":"1900"}

{"sheet":"Sheet1","index":0,"n_rows":504,"n_cols":17,"rows_kept":504,"cut":false,"hidden":false,"merged":[[2,1,2,8],[0,2,0,9],[1,1,1,3]]}
[null,null,"SITE VISIT Qm CREATOR v1.1"]
["SiteVisit Email:","YOURID@usgs.gov"]
["Output Path:","C:\\Documents and Settings\\jnielsen\\Desktop\\"]
["Meas No.","Station No.","Date","Party","Width","Area","Velocity","Gage Ht","Discharge","Qm Rated","Disch Method","Control Condition","Water Temp (°C)","Air Temp (°C)","Entry Status"]
[1,"01010000","2010-10-01","jjj",null,null,null,null,12,null,"QFLUM",null,100,50,{"$f":"IF(OR(A5<>\"\",B5<>\"\",C5<>\"\",D5<>\"\",E5<>\"\",F5<>\"\",G5<>\"\",H5<>\"\",I5<>\"\",J5<>\"\",K5<>\"\",L5<>\"\",M5<>\"\",N5<>\"\"),IF(AND(A5<>\"\",B5<>\"\",C5<>\"\",D5<>\"\",I5<>\"\",K5<>\"\"),\"COMPLETE\",\"INCOMPLETE\"),\"\")","v":"COMPLETE"},{"$f":"IF(J5<>\"\",VLOOKUP(UPPER(J5),Sheet2!$A$3:$B$7,2,FALSE),\"\")","v":""},{"$f":"IF(L5<>\"\",VLOOKUP(UPPER(L5),Sheet2!$A$9:$B$24,2,FALSE),\"\")","v":""}]
[null,null,null,null,null,null,null,null,null,null,null,null,null,null,{"$f":"IF(OR(A6<>\"\",B6<>\"\",C6<>\"\",D6<>\"\",E6<>\"\",F6<>\"\",G6<>\"\",H6<>\"\",I6<>\"\",J6<>\"\",K6<>\"\",L6<>\"\",M6<>\"\",N6<>\"\"),IF(AND(A6<>\"\",B6<>\"\",C6<>\"\",D6<>\"\",I6<>\"\",K6<>\"\"),\"COMPLETE\",\"INCOMPLETE\"),\"\")","v":""},{"$f":"IF(J6<>\"\",VLOOKUP(UPPER(J6),Sheet2!$A$3:$B$7,2,FALSE),\"\")","v":""},{"$f":"IF(L6<>\"\",VLOOKUP(UPPER(L6),Sheet2!$A$9:$B$24,2,FALSE),\"\")","v":""}]
[null,null,null,null,null,null,null,null,null,null,null,null,null,null,"",{"$f":"IF(J7<>\"\",VLOOKUP(UPPER(J7),Sheet2!$A$3:$B$7,2,FALSE),\"\")","v":""},{"$f":"IF(L7<>\"\",VLOOKUP(UPPER(L7),Sheet2!$A$9:$B$24,2,FALSE),\"\")","v":""}]
[null,null,null,null,null,null,null,null,null,null,null,null,null,null,"",{"$f":"IF(J8<>\"\",VLOOKUP(UPPER(J8),Sheet2!$A$3:$B$7,2,FALSE),\"\")","v":""},{"$f":"IF(L8<>\"\",VLOOKUP(UPPER(L8),Sheet2!$A$9:$B$24,2,FALSE),\"\")","v":""}]
[null,null,null,null,null,null,null,null,null,null,null,null,null,null,"",{"$f":"IF(J9<>\"\",VLOOKUP(UPPER(J9),Sheet2!$A$3:$B$7,2,FALSE),\"\")","v":""},{"$f":"IF(L9<>\"\",VLOOKUP(UPPER(L9),Sheet2!$A$9:$B$24,2,FALSE),\"\")","v":""}]
[null,null,null,null,null,null,null,null,null,null,null,null,null,null,"",{"$f":"IF(J10<>\"\",VLOOKUP(UPPER(J10),Sheet2!$A$3:$B$7,2,FALSE),\"\")","v":""},{"$f":"IF(L10<>\"\",VLOOKUP(UPPER(L10),Sheet2!$A$9:$B$24,2,FALSE),\"\")","v":""}]
[null,null,null,null,null,null,null,null,null,null,null,null,null,null,"",{"$f":"IF(J11<>\"\",VLOOKUP(UPPER(J11),Sheet2!$A$3:$B$7,2,FALSE),\"\")","v":""},{"$f":"IF(L11<>\"\",VLOOKUP(UPPER(L11),Sheet2!$A$9:$B$24,2,FALSE),\"\")","v":""}]
[null,null,null,null,null,null,null,null,null,null,null,null,null,null,"",{"$f":"IF(J12<>\"\",VLOOKUP(UPPER(J12),Sheet2!$A$3:$B$7,2,FALSE),\"\")","v":""},{"$f":"IF(L12<>\"\",VLOOKUP(UPPER(L12),Sheet2!$A$9:$B$24,2,FALSE),\"\")","v":""}]
[null,null,null,null,null,null,null,null,null,null,null,null,null,null,"",{"$f":"IF(J13<>\"\",VLOOKUP(UPPER(J13),Sheet2!$A$3:$B$7,2,FALSE),\"\")","v":""},{"$f":"IF(L13<>\"\",VLOOKUP(UPPER(L13),Sheet2!$A$9:$B$24,2,FALSE),\"\")","v":""}]
[null,null,null,null,null,null,null,null,null,null,null,null,null,null,"",{"$f":"IF(J14<>\"\",VLOOKUP(UPPER(J14),Sheet2!$A$3:$B$7,2,FALSE),\"\")","v":""},{"$f":"IF(L14<>\"\",VLOOKUP(UPPER(L14),Sheet2!$A$9:$B$24,2,FALSE),\"\")","v":""}]
[null,null,null,null,null,null,null,null,null,null,null,null,null,null,"",{"$f":"IF(J15<>\"\",VLOOKUP(UPPER(J15),Sheet2!$A$3:$B$7,2,FALSE),\"\")","v":""},{"$f":"IF(L15<>\"\",VLOOKUP(UPPER(L15),Sheet2!$A$9:$B$24,2,FALSE),\"\")","v":""}]
[null,null,null,null,null,null,null,null,null,null,null,null,null,null,"",{"$f":"IF(J16<>\"\",VLOOKUP(UPPER(J16),Sheet2!$A$3:$B$7,2,FALSE),\"\")","v":""},{"$f":"IF(L16<>\"\",VLOOKUP(UPPER(L16),Sheet2!$A$9:$B$24,2,FALSE),\"\")","v":""}]
[null,null,null,null,null,null,null,null,null,null,null,null,null,null,"",{"$f":"IF(J17<>\"\",VLOOKUP(UPPER(J17),Sheet2!$A$3:$B$7,2,FALSE),\"\")","v":""},{"$f":"IF(L17<>\"\",VLOOKUP(UPPER(L17),Sheet2!$A$9:$B$24,2,FALSE),\"\")","v":""}]
[null,null,null,null,null,null,null,null,null,null,null,null,null,null,"",{"$f":"IF(J18<>\"\",VLOOKUP(UPPER(J18),Sheet2!$A$3:$B$7,2,FALSE),\"\")","v":""},{"$f":"IF(L18<>\"\",VLOOKUP(UPPER(L18),Sheet2!$A$9:$B$24,2,FALSE),\"\")","v":""}]
[null,null,null,null,null,null,null,null,null,null,null,null,null,null,"",{"$f":"IF(J19<>\"\",VLOOKUP(UPPER(J19),Sheet2!$A$3:$B$7,2,FALSE),\"\")","v":""},{"$f":"IF(L19<>\"\",VLOOKUP(UPPER(L19),Sheet2!$A$9:$B$24,2,FALSE),\"\")","v":""}]
[null,null,null,null,null,null,null,null,null,null,null,null,null,null,"",{"$f":"IF(J20<>\"\",VLOOKUP(UPPER(J20),Sheet2!$A$3:$B$7,2,FALSE),\"\")","v":""},{"$f":"IF(L20<>\"\",VLOOKUP(UPPER(L20),Sheet2!$A$9:$B$24,2,FALSE),\"\")","v":""}]
[null,null,null,null,null,null,null,null,null,null,null,null,null,null,"",{"$f":"IF(J21<>\"\",VLOOKUP(UPPER(J21),Sheet2!$A$3:$B$7,2,FALSE),\"\")","v":""},{"$f":"IF(L21<>\"\",VLOOKUP(UPPER(L21),Sheet2!$A$9:$B$24,2,FALSE),\"\")","v":""}]
[null,null,null,null,null,null,null,null,null,null,null,null,null,null,"",{"$f":"IF(J22<>\"\",VLOOKUP(UPPER(J22),Sheet2!$A$3:$B$7,2,FALSE),\"\")","v":""},{"$f":"IF(L22<>\"\",VLOOKUP(UPPER(L22),Sheet2!$A$9:$B$24,2,FALSE),\"\")","v":""}]
[null,null,null,null,null,null,null,null,null,null,null,null,null,null,"",{"$f":"IF(J23<>\"\",VLOOKUP(UPPER(J23),Sheet2!$A$3:$B$7,2,FALSE),\"\")","v":""},{"$f":"IF(L23<>\"\",VLOOKUP(UPPER(L23),Sheet2!$A$9:$B$24,2,FALSE),\"\")","v":""}]
[null,null,null,null,null,null,null,null,null,null,null,null,null,null,"",{"$f":"IF(J24<>\"\",VLOOKUP(UPPER(J24),Sheet2!$A$3:$B$7,2,FALSE),\"\")","v":""},{"$f":"IF(L24<>\"\",VLOOKUP(UPPER(L24),Sheet2!$A$9:$B$24,2,FALSE),\"\")","v":""}]
[null,null,null,null,null,null,null,null,null,null,null,null,null,null,"",{"$f":"IF(J25<>\"\",VLOOKUP(UPPER(J25),Sheet2!$A$3:$B$7,2,FALSE),\"\")","v":""},{"$f":"IF(L25<>\"\",VLOOKUP(UPPER(L25),Sheet2!$A$9:$B$24,2,FALSE),\"\")","v":""}]
[null,null,null,null,null,null,null,null,null,null,null,null,null,null,"",{"$f":"IF(J26<>\"\",VLOOKUP(UPPER(J26),Sheet2!$A$3:$B$7,2,FALSE),\"\")","v":""},{"$f":"IF(L26<>\"\",VLOOKUP(UPPER(L26),Sheet2!$A$9:$B$24,2,FALSE),\"\")","v":""}]
[null,null,null,null,null,null,null,null,null,null,null,null,null,null,"",{"$f":"IF(J27<>\"\",VLOOKUP(UPPER(J27),Sheet2!$A$3:$B$7,2,FALSE),\"\")","v":""},{"$f":"IF(L27<>\"\",VLOOKUP(UPPER(L27),Sheet2!$A$9:$B$24,2,FALSE),\"\")","v":""}]
[null,null,null,null,null,null,null,null,null,null,null,null,null,null,"",{"$f":"IF(J28<>\"\",VLOOKUP(UPPER(J28),Sheet2!$A$3:$B$7,2,FALSE),\"\")","v":""},{"$f":"IF(L28<>\"\",VLOOKUP(UPPER(L28),Sheet2!$A$9:$B$24,2,FALSE),\"\")","v":""}]
[null,null,null,null,null,null,null,null,null,null,null,null,null,null,"",{"$f":"IF(J29<>\"\",VLOOKUP(UPPER(J29),Sheet2!$A$3:$B$7,2,FALSE),\"\")","v":""},{"$f":"IF(L29<>\"\",VLOOKUP(UPPER(L29),Sheet2!$A$9:$B$24,2,FALSE),\"\")","v":""}]
[null,null,null,null,null,null,null,null,null,null,null,null,null,null,"",{"$f":"IF(J30<>\"\",VLOOKUP(UPPER(J30),Sheet2!$A$3:$B$7,2,FALSE),\"\")","v":""},{"$f":"IF(L30<>\"\",VLOOKUP(UPPER(L30),Sheet2!$A$9:$B$24,2,FALSE),\"\")","v":""}]
[null,null,null,null,null,null,null,null,null,null,null,null,null,null,"",{"$f":"IF(J31<>\"\",VLOOKUP(UPPER(J31),Sheet2!$A$3:$B$7,2,FALSE),\"\")","v":""},{"$f":"IF(L31<>\"\",VLOOKUP(UPPER(L31),Sheet2!$A$9:$B$24,2,FALSE),\"\")","v":""}]
[null,null,null,null,null,null,null,null,null,null,null,null,null,null,"",{"$f":"IF(J32<>\"\",VLOOKUP(UPPER(J32),Sheet2!$A$3:$B$7,2,FALSE),\"\")","v":""},{"$f":"IF(L32<>\"\",VLOOKUP(UPPER(L32),Sheet2!$A$9:$B$24,2,FALSE),\"\")","v":""}]
[null,null,null,null,null,null,null,null,null,null,null,null,null,null,"",{"$f":"IF(J33<>\"\",VLOOKUP(UPPER(J33),Sheet2!$A$3:$B$7,2,FALSE),\"\")","v":""},{"$f":"IF(L33<>\"\",VLOOKUP(UPPER(L33),Sheet2!$A$9:$B$24,2,FALSE),\"\")","v":""}]
[null,null,null,null,null,null,null,null,null,null,null,null,null,null,"",{"$f":"IF(J34<>\"\",VLOOKUP(UPPER(J34),Sheet2!$A$3:$B$7,2,FALSE),\"\")","v":""},{"$f":"IF(L34<>\"\",VLOOKUP(UPPER(L34),Sheet2!$A$9:$B$24,2,FALSE),\"\")","v":""}]
[null,null,null,null,null,null,null,null,null,null,null,null,null,null,"",{"$f":"IF(J35<>\"\",VLOOKUP(UPPER(J35),Sheet2!$A$3:$B$7,2,FALSE),\"\")","v":""},{"$f":"IF(L35<>\"\",VLOOKUP(UPPER(L35),Sheet2!$A$9:$B$24,2,FALSE),\"\")","v":""}]
[null,null,null,null,null,null,null,null,null,null,null,null,null,null,"",{"$f":"IF(J36<>\"\",VLOOKUP(UPPER(J36),Sheet2!$A$3:$B$7,2,FALSE),\"\")","v":""},{"$f":"IF(L36<>\"\",VLOOKUP(UPPER(L36),Sheet2!$A$9:$B$24,2,FALSE),\"\")","v":""}]
[null,null,null,null,null,null,null,null,null,null,null,null,null,null,"",{"$f":"IF(J37<>\"\",VLOOKUP(UPPER(J37),Sheet2!$A$3:$B$7,2,FALSE),\"\")","v":""},{"$f":"IF(L37<>\"\",VLOOKUP(UPPER(L37),Sheet2!$A$9:$B$24,2,FALSE),\"\")","v":""}]
[null,null,null,null,null,null,null,null,null,null,null,null,null,null,"",{"$f":"IF(J38<>\"\",VLOOKUP(UPPER(J38),Sheet2!$A$3:$B$7,2,FALSE),\"\")","v":""},{"$f":"IF(L38<>\"\",VLOOKUP(UPPER(L38),Sheet2!$A$9:$B$24,2,FALSE),\"\")","v":""}]
[null,null,null,null,null,null,null,null,null,null,null,null,null,null,"",{"$f":"IF(J39<>\"\",VLOOKUP(UPPER(J39),Sheet2!$A$3:$B$7,2,FALSE),\"\")","v":""},{"$f":"IF(L39<>\"\",VLOOKUP(UPPER(L39),Sheet2!$A$9:$B$24,2,FALSE),\"\")","v":""}]
[null,null,null,null,null,null,null,null,null,null,null,null,null,null,"",{"$f":"IF(J40<>\"\",VLOOKUP(UPPER(J40),Sheet2!$A$3:$B$7,2,FALSE),\"\")","v":""},{"$f":"IF(L40<>\"\",VLOOKUP(UPPER(L40),Sheet2!$A$9:$B$24,2,FALSE),\"\")","v":""}]
[null,null,null,null,null,null,null,null,null,null,null,null,null,null,"",{"$f":"IF(J41<>\"\",VLOOKUP(UPPER(J41),Sheet2!$A$3:$B$7,2,FALSE),\"\")","v":""},{"$f":"IF(L41<>\"\",VLOOKUP(UPPER(L41),Sheet2!$A$9:$B$24,2,FALSE),\"\")","v":""}]
[null,null,null,null,null,null,null,null,null,null,null,null,null,null,"",{"$f":"IF(J42<>\"\",VLOOKUP(UPPER(J42),Sheet2!$A$3:$B$7,2,FALSE),\"\")","v":""},{"$f":"IF(L42<>\"\",VLOOKUP(UPPER(L42),Sheet2!$A$9:$B$24,2,FALSE),\"\")","v":""}]
[null,null,null,null,null,null,null,null,null,null,null,null,null,null,"",{"$f":"IF(J43<>\"\",VLOOKUP(UPPER(J43),Sheet2!$A$3:$B$7,2,FALSE),\"\")","v":""},{"$f":"IF(L43<>\"\",VLOOKUP(UPPER(L43),Sheet2!$A$9:$B$24,2,FALSE),\"\")","v":""}]
[null,null,null,null,null,null,null,null,null,null,null,null,null,null,"",{"$f":"IF(J44<>\"\",VLOOKUP(UPPER(J44),Sheet2!$A$3:$B$7,2,FALSE),\"\")","v":""},{"$f":"IF(L44<>\"\",VLOOKUP(UPPER(L44),Sheet2!$A$9:$B$24,2,FALSE),\"\")","v":""}]
[null,null,null,null,null,null,null,null,null,null,null,null,null,null,"",{"$f":"IF(J45<>\"\",VLOOKUP(UPPER(J45),Sheet2!$A$3:$B$7,2,FALSE),\"\")","v":""},{"$f":"IF(L45<>\"\",VLOOKUP(UPPER(L45),Sheet2!$A$9:$B$24,2,FALSE),\"\")","v":""}]
[null,null,null,null,null,null,null,null,null,null,null,null,null,null,"",{"$f":"IF(J46<>\"\",VLOOKUP(UPPER(J46),Sheet2!$A$3:$B$7,2,FALSE),\"\")","v":""},{"$f":"IF(L46<>\"\",VLOOKUP(UPPER(L46),Sheet2!$A$9:$B$24,2,FALSE),\"\")","v":""}]
[null,null,null,null,null,null,null,null,null,null,null,null,null,null,"",{"$f":"IF(J47<>\"\",VLOOKUP(UPPER(J47),Sheet2!$A$3:$B$7,2,FALSE),\"\")","v":""},{"$f":"IF(L47<>\"\",VLOOKUP(UPPER(L47),Sheet2!$A$9:$B$24,2,FALSE),\"\")","v":""}]
[null,null,null,null,null,null,null,null,null,null,null,null,null,null,"",{"$f":"IF(J48<>\"\",VLOOKUP(UPPER(J48),Sheet2!$A$3:$B$7,2,FALSE),\"\")","v":""},{"$f":"IF(L48<>\"\",VLOOKUP(UPPER(L48),Sheet2!$A$9:$B$24,2,FALSE),\"\")","v":""}]
[null,null,null,null,null,null,null,null,null,null,null,null,null,null,"",{"$f":"IF(J49<>\"\",VLOOKUP(UPPER(J49),Sheet2!$A$3:$B$7,2,FALSE),\"\")","v":""},{"$f":"IF(L49<>\"\",VLOOKUP(UPPER(L49),Sheet2!$A$9:$B$24,2,FALSE),\"\")","v":""}]
[null,null,null,null,null,null,null,null,null,null,null,null,null,null,"",{"$f":"IF(J50<>\"\",VLOOKUP(UPPER(J50),Sheet2!$A$3:$B$7,2,FALSE),\"\")","v":""},{"$f":"IF(L50<>\"\",VLOOKUP(UPPER(L50),Sheet2!$A$9:$B$24,2,FALSE),\"\")","v":""}]
[null,null,null,null,null,null,null,null,null,null,null,null,null,null,"",{"$f":"IF(J51<>\"\",VLOOKUP(UPPER(J51),Sheet2!$A$3:$B$7,2,FALSE),\"\")","v":""},{"$f":"IF(L51<>\"\",VLOOKUP(UPPER(L51),Sheet2!$A$9:$B$24,2,FALSE),\"\")","v":""}]
[null,null,null,null,null,null,null,null,null,null,null,null,null,null,"",{"$f":"IF(J52<>\"\",VLOOKUP(UPPER(J52),Sheet2!$A$3:$B$7,2,FALSE),\"\")","v":""},{"$f":"IF(L52<>\"\",VLOOKUP(UPPER(L52),Sheet2!$A$9:$B$24,2,FALSE),\"\")","v":""}]
[null,null,null,null,null,null,null,null,null,null,null,null,null,null,"",{"$f":"IF(J53<>\"\",VLOOKUP(UPPER(J53),Sheet2!$A$3:$B$7,2,FALSE),\"\")","v":""},{"$f":"IF(L53<>\"\",VLOOKUP(UPPER(L53),Sheet2!$A$9:$B$24,2,FALSE),\"\")","v":""}]
[null,null,null,null,null,null,null,null,null,null,null,null,null,null,"",{"$f":"IF(J54<>\"\",VLOOKUP(UPPER(J54),Sheet2!$A$3:$B$7,2,FALSE),\"\")","v":""},{"$f":"IF(L54<>\"\",VLOOKUP(UPPER(L54),Sheet2!$A$9:$B$24,2,FALSE),\"\")","v":""}]
[null,null,null,null,null,null,null,null,null,null,null,null,null,null,"",{"$f":"IF(J55<>\"\",VLOOKUP(UPPER(J55),Sheet2!$A$3:$B$7,2,FALSE),\"\")","v":""},{"$f":"IF(L55<>\"\",VLOOKUP(UPPER(L55),Sheet2!$A$9:$B$24,2,FALSE),\"\")","v":""}]
[null,null,null,null,null,null,null,null,null,null,null,null,null,null,"",{"$f":"IF(J56<>\"\",VLOOKUP(UPPER(J56),Sheet2!$A$3:$B$7,2,FALSE),\"\")","v":""},{"$f":"IF(L56<>\"\",VLOOKUP(UPPER(L56),Sheet2!$A$9:$B$24,2,FALSE),\"\")","v":""}]
[null,null,null,null,null,null,null,null,null,null,null,null,null,null,"",{"$f":"IF(J57<>\"\",VLOOKUP(UPPER(J57),Sheet2!$A$3:$B$7,2,FALSE),\"\")","v":""},{"$f":"IF(L57<>\"\",VLOOKUP(UPPER(L57),Sheet2!$A$9:$B$24,2,FALSE),\"\")","v":""}]
[null,null,null,null,null,null,null,null,null,null,null,null,null,null,"",{"$f":"IF(J58<>\"\",VLOOKUP(UPPER(J58),Sheet2!$A$3:$B$7,2,FALSE),\"\")","v":""},{"$f":"IF(L58<>\"\",VLOOKUP(UPPER(L58),Sheet2!$A$9:$B$24,2,FALSE),\"\")","v":""}]
[null,null,null,null,null,null,null,null,null,null,null,null,null,null,"",{"$f":"IF(J59<>\"\",VLOOKUP(UPPER(J59),Sheet2!$A$3:$B$7,2,FALSE),\"\")","v":""},{"$f":"IF(L59<>\"\",VLOOKUP(UPPER(L59),Sheet2!$A$9:$B$24,2,FALSE),\"\")","v":""}]
[null,null,null,null,null,null,null,null,null,null,null,null,null,null,"",{"$f":"IF(J60<>\"\",VLOOKUP(UPPER(J60),Sheet2!$A$3:$B$7,2,FALSE),\"\")","v":""},{"$f":"IF(L60<>\"\",VLOOKUP(UPPER(L60),Sheet2!$A$9:$B$24,2,FALSE),\"\")","v":""}]
[null,null,null,null,null,null,null,null,null,null,null,null,null,null,"",{"$f":"IF(J61<>\"\",VLOOKUP(UPPER(J61),Sheet2!$A$3:$B$7,2,FALSE),\"\")","v":""},{"$f":"IF(L61<>\"\",VLOOKUP(UPPER(L61),Sheet2!$A$9:$B$24,2,FALSE),\"\")","v":""}]
[null,null,null,null,null,null,null,null,null,null,null,null,null,null,"",{"$f":"IF(J62<>\"\",VLOOKUP(UPPER(J62),Sheet2!$A$3:$B$7,2,FALSE),\"\")","v":""},{"$f":"IF(L62<>\"\",VLOOKUP(UPPER(L62),Sheet2!$A$9:$B$24,2,FALSE),\"\")","v":""}]
[null,null,null,null,null,null,null,null,null,null,null,null,null,null,"",{"$f":"IF(J63<>\"\",VLOOKUP(UPPER(J63),Sheet2!$A$3:$B$7,2,FALSE),\"\")","v":""},{"$f":"IF(L63<>\"\",VLOOKUP(UPPER(L63),Sheet2!$A$9:$B$24,2,FALSE),\"\")","v":""}]
[null,null,null,null,null,null,null,null,null,null,null,null,null,null,"",{"$f":"IF(J64<>\"\",VLOOKUP(UPPER(J64),Sheet2!$A$3:$B$7,2,FALSE),\"\")","v":""},{"$f":"IF(L64<>\"\",VLOOKUP(UPPER(L64),Sheet2!$A$9:$B$24,2,FALSE),\"\")","v":""}]
[null,null,null,null,null,null,null,null,null,null,null,null,null,null,"",{"$f":"IF(J65<>\"\",VLOOKUP(UPPER(J65),Sheet2!$A$3:$B$7,2,FALSE),\"\")","v":""},{"$f":"IF(L65<>\"\",VLOOKUP(UPPER(L65),Sheet2!$A$9:$B$24,2,FALSE),\"\")","v":""}]
[null,null,null,null,null,null,null,null,null,null,null,null,null,null,"",{"$f":"IF(J66<>\"\",VLOOKUP(UPPER(J66),Sheet2!$A$3:$B$7,2,FALSE),\"\")","v":""},{"$f":"IF(L66<>\"\",VLOOKUP(UPPER(L66),Sheet2!$A$9:$B$24,2,FALSE),\"\")","v":""}]
[null,null,null,null,null,null,null,null,null,null,null,null,null,null,"",{"$f":"IF(J67<>\"\",VLOOKUP(UPPER(J67),Sheet2!$A$3:$B$7,2,FALSE),\"\")","v":""},{"$f":"IF(L67<>\"\",VLOOKUP(UPPER(L67),Sheet2!$A$9:$B$24,2,FALSE),\"\")","v":""}]
[null,null,null,null,null,null,null,null,null,null,null,null,null,null,"",{"$f":"IF(J68<>\"\",VLOOKUP(UPPER(J68),Sheet2!$A$3:$B$7,2,FALSE),\"\")","v":""},{"$f":"IF(L68<>\"\",VLOOKUP(UPPER(L68),Sheet2!$A$9:$B$24,2,FALSE),\"\")","v":""}]
[null,null,null,null,null,null,null,null,null,null,null,null,null,null,"",{"$f":"IF(J69<>\"\",VLOOKUP(UPPER(J69),Sheet2!$A$3:$B$7,2,FALSE),\"\")","v":""},{"$f":"IF(L69<>\"\",VLOOKUP(UPPER(L69),Sheet2!$A$9:$B$24,2,FALSE),\"\")","v":""}]
[null,null,null,null,null,null,null,null,null,null,null,null,null,null,{"$f":"IF(OR(A70<>\"\",B70<>\"\",C70<>\"\",D70<>\"\",E70<>\"\",F70<>\"\",G70<>\"\",H70<>\"\",I70<>\"\",J70<>\"\",K70<>\"\",L70<>\"\",M70<>\"\",N70<>\"\"),IF(AND(A70<>\"\",B70<>\"\",C70<>\"\",D70<>\"\",I70<>\"\",K70<>\"\"),\"COMPLETE\",\"INCOMPLETE\"),\"\")","v":""},{"$f":"IF(J70<>\"\",VLOOKUP(UPPER(J70),Sheet2!$A$3:$B$7,2,FALSE),\"\")","v":""},{"$f":"IF(L70<>\"\",VLOOKUP(UPPER(L70),Sheet2!$A$9:$B$24,2,FALSE),\"\")","v":""}]
[null,null,null,null,null,null,null,null,null,null,null,null,null,null,"",{"$f":"IF(J71<>\"\",VLOOKUP(UPPER(J71),Sheet2!$A$3:$B$7,2,FALSE),\"\")","v":""},{"$f":"IF(L71<>\"\",VLOOKUP(UPPER(L71),Sheet2!$A$9:$B$24,2,FALSE),\"\")","v":""}]
[null,null,null,null,null,null,null,null,null,null,null,null,null,null,"",{"$f":"IF(J72<>\"\",VLOOKUP(UPPER(J72),Sheet2!$A$3:$B$7,2,FALSE),\"\")","v":""},{"$f":"IF(L72<>\"\",VLOOKUP(UPPER(L72),Sheet2!$A$9:$B$24,2,FALSE),\"\")","v":""}]
[null,null,null,null,null,null,null,null,null,null,null,null,null,null,"",{"$f":"IF(J73<>\"\",VLOOKUP(UPPER(J73),Sheet2!$A$3:$B$7,2,FALSE),\"\")","v":""},{"$f":"IF(L73<>\"\",VLOOKUP(UPPER(L73),Sheet2!$A$9:$B$24,2,FALSE),\"\")","v":""}]
[null,null,null,null,null,null,null,null,null,null,null,null,null,null,"",{"$f":"IF(J74<>\"\",VLOOKUP(UPPER(J74),Sheet2!$A$3:$B$7,2,FALSE),\"\")","v":""},{"$f":"IF(L74<>\"\",VLOOKUP(UPPER(L74),Sheet2!$A$9:$B$24,2,FALSE),\"\")","v":""}]
[null,null,null,null,null,null,null,null,null,null,null,null,null,null,"",{"$f":"IF(J75<>\"\",VLOOKUP(UPPER(J75),Sheet2!$A$3:$B$7,2,FALSE),\"\")","v":""},{"$f":"IF(L75<>\"\",VLOOKUP(UPPER(L75),Sheet2!$A$9:$B$24,2,FALSE),\"\")","v":""}]
[null,null,null,null,null,null,null,null,null,null,null,null,null,null,"",{"$f":"IF(J76<>\"\",VLOOKUP(UPPER(J76),Sheet2!$A$3:$B$7,2,FALSE),\"\")","v":""},{"$f":"IF(L76<>\"\",VLOOKUP(UPPER(L76),Sheet2!$A$9:$B$24,2,FALSE),\"\")","v":""}]
[null,null,null,null,null,null,null,null,null,null,null,null,null,null,"",{"$f":"IF(J77<>\"\",VLOOKUP(UPPER(J77),Sheet2!$A$3:$B$7,2,FALSE),\"\")","v":""},{"$f":"IF(L77<>\"\",VLOOKUP(UPPER(L77),Sheet2!$A$9:$B$24,2,FALSE),\"\")","v":""}]
[null,null,null,null,null,null,null,null,null,null,null,null,null,null,"",{"$f":"IF(J78<>\"\",VLOOKUP(UPPER(J78),Sheet2!$A$3:$B$7,2,FALSE),\"\")","v":""},{"$f":"IF(L78<>\"\",VLOOKUP(UPPER(L78),Sheet2!$A$9:$B$24,2,FALSE),\"\")","v":""}]
[null,null,null,null,null,null,null,null,null,null,null,null,null,null,"",{"$f":"IF(J79<>\"\",VLOOKUP(UPPER(J79),Sheet2!$A$3:$B$7,2,FALSE),\"\")","v":""},{"$f":"IF(L79<>\"\",VLOOKUP(UPPER(L79),Sheet2!$A$9:$B$24,2,FALSE),\"\")","v":""}]
[null,null,null,null,null,null,null,null,null,null,null,null,null,null,"",{"$f":"IF(J80<>\"\",VLOOKUP(UPPER(J80),Sheet2!$A$3:$B$7,2,FALSE),\"\")","v":""},{"$f":"IF(L80<>\"\",VLOOKUP(UPPER(L80),Sheet2!$A$9:$B$24,2,FALSE),\"\")","v":""}]
{"$rows_left_out":425}
{"sheet":"Sheet2","index":1,"n_rows":24,"n_cols":4,"rows_kept":24,"cut":false,"hidden":false,"merged":[[0,1,0,2]]}
[null,"Reference Lists"]
[]
["E","EXCL",null,"QADCP"]
["G","GOOD",null,"QFLUM"]
["F","FAIR",null,"QSCMM"]
["P","POOR",null,"QVOLM"]
["U","UNSP",null,"QWEIR"]
[]
[]
["Unspecified","UNSP"]
["Anchor ice","AICE"]
["Ice cover","CICE"]
["Clear","CLER"]
["Fill control changed","FILL"]
["Heavy debris","HVDB"]
["Light debris","LGDB"]
["Heavy moss/algae","MAHV"]
["Light moss/algae","MALT"]
["Moderate moss/algae","MAMD"]
["Moderate debris","MDDB"]
["No flow","NFLW"]
["Scour control changed","SCUR"]
["Shore ice","SICE"]
["Submerged","SUBM"]